Reaction Details
TargetDNA dC->dU-editing enzyme APOBEC-3G
LigandBDBM59059
Substrate/Competitorn/a
Meas. Tech.SAR analysis of small molecule inhibitors of APOBEC3G DNA Deaminase via a fluorescence-based single-stranded DNA deaminase assay - Set 2
Temperature298.15±n/a K
IC50 1600±n/a nM
Commentsextracted
Citation PubChem, PC SAR analysis of small molecule inhibitors of APOBEC3G DNA Deaminase via a fluorescence-based single-stranded DNA deaminase assay - Set 2 PubChem Bioassay(2012)[AID]
 
DNA dC->dU-editing enzyme APOBEC-3G
Name:DNA dC->dU-editing enzyme APOBEC-3G
Type:Enzyme Catalytic Domain
Mol. Mass.:46419.54
Organism:Homo sapiens (Human)
Description:gi_13399304
Residue:384
BDBM59059
NameBDBM59059
Synonyms:4-amyl-1-thioxo-2H-[1,2,4]triazolo[4,3-a]quinazolin-5-one MLS001171361 US20230365568, Compound 24 | cid_2081016
TypeSmall organic molecule
Emp. Form.C14H16N4OS
Mol. Mass.288.368
SMILESCCCCCn1c2n[nH]c(=S)n2c2ccccc2c1=O