Reaction Details
TargetProthrombin
LigandBDBM113060
Substrate/Competitorn/a
Meas. Tech.Thrombin Assay
pH8.3±n/a
Temperature310.15±n/a K
Ki>10000±n/a nM
Commentsextracted
Citation Wagberg, FLeonardsson, G Benzoxazinone derivatives for treatment of skin diseases US Patent US9695194 Publication Date 7/4/2017
 
Prothrombin
Name:Prothrombin
Type:Protein
Mol. Mass.:70029.57
Organism:Homo sapiens (Human)
Description:P00734
Residue:622
BDBM113060
NameBDBM113060
Synonyms:US9695194, 1
TypeSmall organic molecule
Emp. Form.C18H17NO4S
Mol. Mass.343.397
SMILESCCOc1cc2c(cc1OC)nc(oc2=O)-c1ccccc1SC