Reaction Details
TargetChymotrypsin-C
LigandBDBM113067
Substrate/Competitorn/a
Meas. Tech.Chymotrypsin Assay
pH7.2±n/a
Temperature310.15±n/a K
Ki>10000±n/a nM
Commentsextracted
Citation Wagberg, FLeonardsson, G Benzoxazinone derivatives for treatment of skin diseases US Patent US9695194 Publication Date 7/4/2017
 
Chymotrypsin-C
Name:Chymotrypsin-C
Type:Enzyme
Mol. Mass.:29487.98
Organism:Homo sapiens (Human)
Description:Q99895
Residue:268
BDBM113067
NameBDBM113067
Synonyms:US9695194, 3
TypeSmall organic molecule
Emp. Form.C19H19NO6
Mol. Mass.357.3573
SMILESCCOc1cc2c(cc1OC)nc(oc2=O)-c1ccc(OC)cc1OC