Reaction Details
TargetChymotrypsin-C
LigandBDBM113069
Substrate/Competitorn/a
Meas. Tech.Chymotrypsin Assay
pH7.2±n/a
Temperature310.15±n/a K
Ki>10000±n/a nM
Commentsextracted
Citation Wagberg, FLeonardsson, G Benzoxazinone derivatives for treatment of skin diseases US Patent US9695194 Publication Date 7/4/2017
 
Chymotrypsin-C
Name:Chymotrypsin-C
Type:Enzyme
Mol. Mass.:29487.98
Organism:Homo sapiens (Human)
Description:Q99895
Residue:268
BDBM113069
NameBDBM113069
Synonyms:US9695194, 5
TypeSmall organic molecule
Emp. Form.C18H17NO5
Mol. Mass.327.3313
SMILESCCOc1cc2c(cc1OC)nc(oc2=O)-c1ccccc1OC