Reaction Details
TargetSerine protease 1
LigandBDBM113069
Substrate/Competitorn/a
Meas. Tech.Trypsin Assay
pH7.2±n/a
Temperature310.15±n/a K
Ki>10000±n/a nM
Commentsextracted
Citation Wagberg, FLeonardsson, G Benzoxazinone derivatives for treatment of skin diseases US Patent US9695194 Publication Date 7/4/2017
 
Serine protease 1
Name:Serine protease 1
Type:Enzyme
Mol. Mass.:26557.80
Organism:Homo sapiens (Human)
Description:P07477
Residue:247
BDBM113069
NameBDBM113069
Synonyms:US9695194, 5
TypeSmall organic molecule
Emp. Form.C18H17NO5
Mol. Mass.327.3313
SMILESCCOc1cc2c(cc1OC)nc(oc2=O)-c1ccccc1OC