Reaction Details
TargetKallikrein-14
LigandBDBM113119
Substrate/Competitorn/a
Meas. Tech.KLK14 Assay
pH8±n/a
Temperature310.15±n/a K
Ki 1400±n/a nM
Commentsextracted
Citation Wagberg, FLeonardsson, G Benzoxazinone derivatives for treatment of skin diseases US Patent US9695194 Publication Date 7/4/2017
 
Kallikrein-14
Name:Kallikrein-14
Type:PROTEIN
Mol. Mass.:29136.99
Organism:Homo sapiens (Human)
Description:ChEMBL_1282452
Residue:267
BDBM113119
NameBDBM113119
Synonyms:US9695194, 6
TypeSmall organic molecule
Emp. Form.C18H15NO5
Mol. Mass.325.3154
SMILESCOc1ccccc1-c1nc2cc3OCCCOc3cc2c(=O)o1