Reaction Details
TargetProthrombin
LigandBDBM113119
Substrate/Competitorn/a
Meas. Tech.Thrombin Assay
pH8.3±n/a
Temperature310.15±n/a K
Ki 600±n/a nM
Commentsextracted
Citation Wagberg, FLeonardsson, G Benzoxazinone derivatives for treatment of skin diseases US Patent US9695194 Publication Date 7/4/2017
 
Prothrombin
Name:Prothrombin
Type:Protein
Mol. Mass.:70029.57
Organism:Homo sapiens (Human)
Description:P00734
Residue:622
BDBM113119
NameBDBM113119
Synonyms:US9695194, 6
TypeSmall organic molecule
Emp. Form.C18H15NO5
Mol. Mass.325.3154
SMILESCOc1ccccc1-c1nc2cc3OCCCOc3cc2c(=O)o1