Reaction Details
TargetSerine protease 1
LigandBDBM113248
Substrate/Competitorn/a
Meas. Tech.Trypsin Assay
pH7.2±n/a
Temperature310.15±n/a K
Ki>10000±n/a nM
Commentsextracted
Citation Wagberg, FLeonardsson, G Benzoxazinone derivatives for treatment of skin diseases US Patent US9695194 Publication Date 7/4/2017
 
Serine protease 1
Name:Serine protease 1
Type:Enzyme
Mol. Mass.:26557.80
Organism:Homo sapiens (Human)
Description:P07477
Residue:247
BDBM113248
NameBDBM113248
Synonyms:US9695194, 7
TypeSmall organic molecule
Emp. Form.C17H12ClNO4
Mol. Mass.329.734
SMILESClc1ccccc1-c1nc2cc3OCCCOc3cc2c(=O)o1