Reaction Details
TargetProthrombin
LigandBDBM113248
Substrate/Competitorn/a
Meas. Tech.Thrombin Assay
pH8.3±n/a
Temperature310.15±n/a K
Ki 500±n/a nM
Commentsextracted
Citation Wagberg, FLeonardsson, G Benzoxazinone derivatives for treatment of skin diseases US Patent US9695194 Publication Date 7/4/2017
 
Prothrombin
Name:Prothrombin
Type:Protein
Mol. Mass.:70029.57
Organism:Homo sapiens (Human)
Description:P00734
Residue:622
BDBM113248
NameBDBM113248
Synonyms:US9695194, 7
TypeSmall organic molecule
Emp. Form.C17H12ClNO4
Mol. Mass.329.734
SMILESClc1ccccc1-c1nc2cc3OCCCOc3cc2c(=O)o1