Reaction Details
TargetKallikrein-5 [D153N]
LigandBDBM113283
Substrate/Competitorn/a
Meas. Tech.KLK5 Assay
pH8±n/a
Temperature310.15±n/a K
Ki 1000±n/a nM
Commentsextracted
Citation Wagberg, FLeonardsson, G Benzoxazinone derivatives for treatment of skin diseases US Patent US9695194 Publication Date 7/4/2017
 
Kallikrein-5 [D153N]
Name:Kallikrein-5 [D153N]
Type:PROTEIN
Mol. Mass.:32031.75
Organism:Homo sapiens (Human)
Description:ChEMBL_1282456
Residue:293
BDBM113283
NameBDBM113283
Synonyms:US9695194, 8
TypeSmall organic molecule
Emp. Form.C19H17NO6
Mol. Mass.355.3414
SMILESCOc1ccc(c(OC)c1)-c1nc2cc3OCCCOc3cc2c(=O)o1