Reaction Details
TargetChymotrypsin-C
LigandBDBM113283
Substrate/Competitorn/a
Meas. Tech.Chymotrypsin Assay
pH7.2±n/a
Temperature310.15±n/a K
Ki<100±n/a nM
Commentsextracted
Citation Wagberg, FLeonardsson, G Benzoxazinone derivatives for treatment of skin diseases US Patent US9695194 Publication Date 7/4/2017
 
Chymotrypsin-C
Name:Chymotrypsin-C
Type:Enzyme
Mol. Mass.:29487.98
Organism:Homo sapiens (Human)
Description:Q99895
Residue:268
BDBM113283
NameBDBM113283
Synonyms:US9695194, 8
TypeSmall organic molecule
Emp. Form.C19H17NO6
Mol. Mass.355.3414
SMILESCOc1ccc(c(OC)c1)-c1nc2cc3OCCCOc3cc2c(=O)o1