Reaction Details
TargetInterleukin-1 receptor-associated kinase 4
LigandBDBM278846
Substrate/Competitorn/a
Meas. Tech.IRAK4 Kinase Assay
pH7.2±n/a
IC50 0.200±n/a nM
Commentsextracted
Citation Lim, JAltman, MDGibeau, CR Thienopyrazine inhibitors of IRAK4 activity US Patent US10040802 Publication Date 8/7/2018
 
Interleukin-1 receptor-associated kinase 4
Name:Interleukin-1 receptor-associated kinase 4
Type:Protein
Mol. Mass.:51519.08
Organism:Homo sapiens (Human)
Description:Q9NWZ3
Residue:460
BDBM278846
NameBDBM278846
Synonyms:2-{[(1R,2S)-2- aminocyclohexyl]amino}- N-[3-(difluoromethyl)- 1-methyl-1H-pyrazol- 4-yl]thieno[2,3-b] pyrazine-7- carboxamide trifluoroacetate | US10040802, Example 25
TypeSmall organic molecule
Emp. Form.C20H22F5N7O3S
Mol. Mass.535.491
SMILESOC(=O)C(F)(F)F.Cn1cc(NC(=O)c2csc3ncc(N[C@@H]4CCCC[C@@H]4N)nc23)c(n1)C(F)F