Reaction Details
TargetTyrosine-protein phosphatase non-receptor type 5
LigandBDBM46280
Substrate/Competitorn/a
Meas. Tech.Dose response orthogonal assay of uHTS small molecule inhibitors of Striatal-Enriched Phosphatase via a colorimetric intensity assay.
IC50 37100±n/a nM
Citation PubChem, PC Dose response orthogonal assay of uHTS small molecule inhibitors of Striatal-Enriched Phosphatase via a colorimetric intensity assay. PubChem Bioassay(2012)[AID]
 
Tyrosine-protein phosphatase non-receptor type 5
Name:Tyrosine-protein phosphatase non-receptor type 5
Type:Enzyme Catalytic Domain
Mol. Mass.:63510.68
Organism:Homo sapiens (Human)
Description:gi_90652859
Residue:565
BDBM46280
NameBDBM46280
Synonyms:2-[4-[(Z)-[2-(4-ethylanilino)-4-keto-2-thiazolin-5-ylidene]methyl]phenoxy]acetic acid 2-[4-[(Z)-[2-(4-ethylanilino)-4-oxo-5-thiazolylidene]methyl]phenoxy]acetic acid MLS-0425605.0001 | cid_5765582
TypeSmall organic molecule
Emp. Form.C20H18N2O4S
Mol. Mass.382.433
SMILESCCc1ccc(NC2=NC(=O)C(S2)=Cc2ccc(OCC(O)=O)cc2)cc1