Reaction Details
TargetTyrosine-protein phosphatase non-receptor type 22
LigandBDBM40987
Substrate/Competitorn/a
Meas. Tech.Dose Response selectivity of inhibitors of STriatal-Enriched Phosphatase (STEP) in the Lymphoid Phosphatase (PTPN22) Inhibition Assay
IC50>100000±0 nM
Citation PubChem, PC Dose Response selectivity of inhibitors of STriatal-Enriched Phosphatase (STEP) in the Lymphoid Phosphatase (PTPN22) Inhibition Assay PubChem Bioassay(2012)[AID]
 
Tyrosine-protein phosphatase non-receptor type 22
Name:Tyrosine-protein phosphatase non-receptor type 22
Type:n/a
Mol. Mass.:91712.31
Organism:Homo sapiens (Human)
Description:Q9Y2R2
Residue:807
BDBM40987
NameBDBM40987
Synonyms:MLS000109444 N-[(4Z)-4-(3H-1,3-benzoxazol-2-ylidene)-3-keto-cyclohexa-1,5-dien-1-yl]-2-(4-ethylphenoxy)acetamide N-[(4Z)-4-(3H-1,3-benzoxazol-2-ylidene)-3-oxo-1-cyclohexa-1,5-dienyl]-2-(4-ethylphenoxy)acetamide SMR000105387 | cid_5922605
TypeSmall organic molecule
Emp. Form.C23H20N2O4
Mol. Mass.388.4159
SMILESCCc1ccc(OCC(=O)Nc2ccc(-c3nc4ccccc4o3)c(O)c2)cc1