Reaction Details
TargetTyrosine-protein phosphatase non-receptor type 22
LigandBDBM40211
Substrate/Competitorn/a
Meas. Tech.Dose Response selectivity of inhibitors of STriatal-Enriched Phosphatase (STEP) in the Lymphoid Phosphatase (PTPN22) Inhibition Assay
IC50 21784±1210 nM
Citation PubChem, PC Dose Response selectivity of inhibitors of STriatal-Enriched Phosphatase (STEP) in the Lymphoid Phosphatase (PTPN22) Inhibition Assay PubChem Bioassay(2012)[AID]
 
Tyrosine-protein phosphatase non-receptor type 22
Name:Tyrosine-protein phosphatase non-receptor type 22
Type:n/a
Mol. Mass.:91712.31
Organism:Homo sapiens (Human)
Description:Q9Y2R2
Residue:807
BDBM40211
NameBDBM40211
Synonyms:5-(tosylmethyl)-2-furoic acid 5-[(4-methylphenyl)sulfonylmethyl]furan-2-carboxylic acid SMR000132396 | cid_9551108
TypeSmall organic molecule
Emp. Form.C13H12O5S
Mol. Mass.280.296
SMILESCc1ccc(cc1)S(=O)(=O)Cc1ccc(o1)C(O)=O