Reaction Details
TargetTyrosine-protein phosphatase non-receptor type 22
LigandBDBM82647
Substrate/Competitorn/a
Meas. Tech.Dose Response selectivity of inhibitors of STriatal-Enriched Phosphatase (STEP) in the Lymphoid Phosphatase (PTPN22) Inhibition Assay
IC50 8327±337 nM
Citation PubChem, PC Dose Response selectivity of inhibitors of STriatal-Enriched Phosphatase (STEP) in the Lymphoid Phosphatase (PTPN22) Inhibition Assay PubChem Bioassay(2012)[AID]
 
Tyrosine-protein phosphatase non-receptor type 22
Name:Tyrosine-protein phosphatase non-receptor type 22
Type:n/a
Mol. Mass.:91712.31
Organism:Homo sapiens (Human)
Description:Q9Y2R2
Residue:807
BDBM82647
NameBDBM82647
Synonyms:2-(1H-benzimidazol-2-ylsulfanyl)-1-(2,3-dimethylindol-1-yl)ethanone 2-(1H-benzimidazol-2-ylthio)-1-(2,3-dimethylindol-1-yl)ethanone MLS000535320 cid_704124
TypeSmall organic molecule
Emp. Form.C19H17N3OS
Mol. Mass.335.423
SMILESCc1c(C)c2ccccc2n1C(=O)CSc1nc2ccccc2[nH]1