Reaction Details
TargetTyrosine-protein phosphatase non-receptor type 22
LigandBDBM88721
Substrate/Competitorn/a
Meas. Tech.Dose Response selectivity of inhibitors of STriatal-Enriched Phosphatase (STEP) in the Lymphoid Phosphatase (PTPN22) Inhibition Assay
IC50 34487±836 nM
Citation PubChem, PC Dose Response selectivity of inhibitors of STriatal-Enriched Phosphatase (STEP) in the Lymphoid Phosphatase (PTPN22) Inhibition Assay PubChem Bioassay(2012)[AID]
 
Tyrosine-protein phosphatase non-receptor type 22
Name:Tyrosine-protein phosphatase non-receptor type 22
Type:n/a
Mol. Mass.:91712.31
Organism:Homo sapiens (Human)
Description:Q9Y2R2
Residue:807
BDBM88721
NameBDBM88721
Synonyms:(4E)-4-[(2-nitro-4-pyrrolidin-1-ylsulfonyl-phenyl)hydrazinylidene]-4-thiophen-2-yl-butanoic acid (4E)-4-[(2-nitro-4-pyrrolidinosulfonyl-phenyl)hydrazono]-4-(2-thienyl)butyric acid MLS000536464 cid_9655853
TypeSmall organic molecule
Emp. Form.C18H20N4O6S2
Mol. Mass.452.505
SMILESOC(=O)CC[C-](\N=[NH+]\c1ccc(cc1[N+]([O-])=O)S(=O)(=O)N1CCCC1)c1cccs1