Reaction Details
TargetTyrosine-protein phosphatase non-receptor type 22
LigandBDBM46206
Substrate/Competitorn/a
Meas. Tech.Dose Response selectivity of inhibitors of STriatal-Enriched Phosphatase (STEP) in the Lymphoid Phosphatase (PTPN22) Inhibition Assay
IC50>100000±0 nM
Citation PubChem, PC Dose Response selectivity of inhibitors of STriatal-Enriched Phosphatase (STEP) in the Lymphoid Phosphatase (PTPN22) Inhibition Assay PubChem Bioassay(2012)[AID]
 
Tyrosine-protein phosphatase non-receptor type 22
Name:Tyrosine-protein phosphatase non-receptor type 22
Type:n/a
Mol. Mass.:91712.31
Organism:Homo sapiens (Human)
Description:Q9Y2R2
Residue:807
BDBM46206
NameBDBM46206
Synonyms:MLS-0109562.0001 [1-(2-phenoxyethyl)indol-3-yl]-pyrrolidin-1-yl-methanethione [1-(2-phenoxyethyl)indol-3-yl]-pyrrolidino-methanethione | cid_1324805
TypeSmall organic molecule
Emp. Form.C21H22N2OS
Mol. Mass.350.477
SMILESS=C(N1CCCC1)c1cn(CCOc2ccccc2)c2ccccc12