Reaction Details
TargetTyrosine-protein phosphatase non-receptor type 22
LigandBDBM61285
Substrate/Competitorn/a
Meas. Tech.Dose Response selectivity of inhibitors of STriatal-Enriched Phosphatase (STEP) in the Lymphoid Phosphatase (PTPN22) Inhibition Assay
IC50 33764±1210 nM
Citation PubChem, PC Dose Response selectivity of inhibitors of STriatal-Enriched Phosphatase (STEP) in the Lymphoid Phosphatase (PTPN22) Inhibition Assay PubChem Bioassay(2012)[AID]
 
Tyrosine-protein phosphatase non-receptor type 22
Name:Tyrosine-protein phosphatase non-receptor type 22
Type:n/a
Mol. Mass.:91712.31
Organism:Homo sapiens (Human)
Description:Q9Y2R2
Residue:807
BDBM61285
NameBDBM61285
Synonyms:2-[2-[(N''E)-N''-[3-(2,4-dichlorobenzyl)oxy-4-methoxy-benzylidene]hydrazino]-4-keto-2-thiazolin-5-yl]acetic acid 2-[2-[2-[[3-[(2,4-dichlorophenyl)methoxy]-4-methoxy-phenyl]methylidene]hydrazinyl]-4-oxidanylidene-1,3-thiazol-5-yl]ethanoic acid 2-[2-[2-[[3-[(2,4-dichlorophenyl)methoxy]-4-methoxyphenyl]methylidene]hydrazinyl]-4-oxo-5-thiazolyl]acetic acid MLS000574282 [2-({3-[(2,4-dichlorobenzyl)oxy]-4-methoxybenzylidene}hydrazono)-4-oxo-1,3-thiazolidin-5-yl]acetic acid | cid_2908089
TypeSmall organic molecule
Emp. Form.C20H17Cl2N3O5S
Mol. Mass.482.337
SMILESCOc1ccc(CN=Nc2nc(O)c(CC(O)=O)s2)cc1OCc1ccc(Cl)cc1Cl