Reaction Details
TargetTyrosine-protein phosphatase non-receptor type 22
LigandBDBM81074
Substrate/Competitorn/a
Meas. Tech.Dose Response selectivity of inhibitors of STriatal-Enriched Phosphatase (STEP) in the Lymphoid Phosphatase (PTPN22) Inhibition Assay
IC50 48431±5230 nM
Citation PubChem, PC Dose Response selectivity of inhibitors of STriatal-Enriched Phosphatase (STEP) in the Lymphoid Phosphatase (PTPN22) Inhibition Assay PubChem Bioassay(2012)[AID]
 
Tyrosine-protein phosphatase non-receptor type 22
Name:Tyrosine-protein phosphatase non-receptor type 22
Type:n/a
Mol. Mass.:91712.31
Organism:Homo sapiens (Human)
Description:Q9Y2R2
Residue:807
BDBM81074
NameBDBM81074
Synonyms:1-[[1-(1-phenylethyl)-3-pyrrolidinyl]methyl]-3-(2,4,6-trimethylphenyl)thiourea 1-mesityl-3-[[1-(1-phenylethyl)pyrrolidin-3-yl]methyl]thiourea N-mesityl-N'-{[1-(1-phenylethyl)pyrrolidin-3-yl]methyl}thiourea cid_4559464
TypeSmall organic molecule
Emp. Form.C23H31N3S
Mol. Mass.381.577
SMILESCC(N1CCC(CNC(=S)Nc2c(C)cc(C)cc2C)C1)c1ccccc1