Reaction Details
TargetTyrosine-protein phosphatase non-receptor type 22
LigandBDBM81080
Substrate/Competitorn/a
Meas. Tech.Dose Response selectivity of inhibitors of STriatal-Enriched Phosphatase (STEP) in the Lymphoid Phosphatase (PTPN22) Inhibition Assay
IC50 45150±4880 nM
Citation PubChem, PC Dose Response selectivity of inhibitors of STriatal-Enriched Phosphatase (STEP) in the Lymphoid Phosphatase (PTPN22) Inhibition Assay PubChem Bioassay(2012)[AID]
 
Tyrosine-protein phosphatase non-receptor type 22
Name:Tyrosine-protein phosphatase non-receptor type 22
Type:n/a
Mol. Mass.:91712.31
Organism:Homo sapiens (Human)
Description:Q9Y2R2
Residue:807
BDBM81080
NameBDBM81080
Synonyms:4-[(4-ethyl-1-piperazinyl)-mercaptomethylidene]-1-cyclohexa-2,5-dienone 4-[(4-ethylpiperazin-1-yl)-sulfanyl-methylidene]cyclohexa-2,5-dien-1-one 4-[(4-ethylpiperazino)-mercapto-methylene]cyclohexa-2,5-dien-1-one SMR000299713 cid_5424195
TypeSmall organic molecule
Emp. Form.C13H18N2OS
Mol. Mass.250.36
SMILESCCN1CCN(CC1)C(=S)c1ccc(O)cc1