Reaction Details
TargetTyrosine-protein phosphatase non-receptor type 22
LigandBDBM88754
Substrate/Competitorn/a
Meas. Tech.Dose Response selectivity of inhibitors of STriatal-Enriched Phosphatase (STEP) in the Lymphoid Phosphatase (PTPN22) Inhibition Assay
IC50 25880±1130 nM
Citation PubChem, PC Dose Response selectivity of inhibitors of STriatal-Enriched Phosphatase (STEP) in the Lymphoid Phosphatase (PTPN22) Inhibition Assay PubChem Bioassay(2012)[AID]
 
Tyrosine-protein phosphatase non-receptor type 22
Name:Tyrosine-protein phosphatase non-receptor type 22
Type:n/a
Mol. Mass.:91712.31
Organism:Homo sapiens (Human)
Description:Q9Y2R2
Residue:807
BDBM88754
NameBDBM88754
Synonyms:MLS000401595 N-[3-[(2-methoxyphenyl)sulfamoyl]-4-pyrrolidin-1-yl-phenyl]-3-methyl-thiophene-2-carboxamide N-[3-[(2-methoxyphenyl)sulfamoyl]-4-pyrrolidino-phenyl]-3-methyl-thiophene-2-carboxamide cid_3457783
TypeSmall organic molecule
Emp. Form.C23H25N3O4S2
Mol. Mass.471.592
SMILESCOc1ccccc1NS(=O)(=O)c1cc(NC(=O)c2sccc2C)ccc1N1CCCC1