Reaction Details
TargetTyrosine-protein phosphatase non-receptor type 22
LigandBDBM88757
Substrate/Competitorn/a
Meas. Tech.Dose Response selectivity of inhibitors of STriatal-Enriched Phosphatase (STEP) in the Lymphoid Phosphatase (PTPN22) Inhibition Assay
IC50 43873±5550 nM
Citation PubChem, PC Dose Response selectivity of inhibitors of STriatal-Enriched Phosphatase (STEP) in the Lymphoid Phosphatase (PTPN22) Inhibition Assay PubChem Bioassay(2012)[AID]
 
Tyrosine-protein phosphatase non-receptor type 22
Name:Tyrosine-protein phosphatase non-receptor type 22
Type:n/a
Mol. Mass.:91712.31
Organism:Homo sapiens (Human)
Description:Q9Y2R2
Residue:807
BDBM88757
NameBDBM88757
Synonyms:1-(3-chloranyl-4-methoxy-phenyl)-3-[2-(4-methylpiperidin-1-yl)ethyl]thiourea 1-(3-chloro-4-methoxyphenyl)-3-[2-(4-methyl-1-piperidinyl)ethyl]thiourea MLS000664868 SMR000294826 | cid_972870
TypeSmall organic molecule
Emp. Form.C16H24ClN3OS
Mol. Mass.341.899
SMILESCOc1ccc(NC(=S)NCCN2CCC(C)CC2)cc1Cl