Reaction Details
TargetTyrosine-protein phosphatase non-receptor type 22
LigandBDBM51772
Substrate/Competitorn/a
Meas. Tech.Dose Response selectivity of inhibitors of STriatal-Enriched Phosphatase (STEP) in the Lymphoid Phosphatase (PTPN22) Inhibition Assay
IC50 9730±3000 nM
Citation PubChem, PC Dose Response selectivity of inhibitors of STriatal-Enriched Phosphatase (STEP) in the Lymphoid Phosphatase (PTPN22) Inhibition Assay PubChem Bioassay(2012)[AID]
 
Tyrosine-protein phosphatase non-receptor type 22
Name:Tyrosine-protein phosphatase non-receptor type 22
Type:n/a
Mol. Mass.:91712.31
Organism:Homo sapiens (Human)
Description:Q9Y2R2
Residue:807
BDBM51772
NameBDBM51772
Synonyms:MLS000665240 N-(4-bromophenyl)-2-(4-methyl-1-piperazinyl)-2-thioxoacetamide N-(4-bromophenyl)-2-(4-methylpiperazin-1-yl)-2-sulfanylideneacetamide SMR000296497 | cid_2977865
TypeSmall organic molecule
Emp. Form.C13H16BrN3OS
Mol. Mass.342.255
SMILESCN1CCN(CC1)C(=S)C(=O)Nc1ccc(Br)cc1