Reaction Details
TargetTyrosine-protein phosphatase non-receptor type 22
LigandBDBM88760
Substrate/Competitorn/a
Meas. Tech.Dose Response selectivity of inhibitors of STriatal-Enriched Phosphatase (STEP) in the Lymphoid Phosphatase (PTPN22) Inhibition Assay
IC50 45627±6760 nM
Citation PubChem, PC Dose Response selectivity of inhibitors of STriatal-Enriched Phosphatase (STEP) in the Lymphoid Phosphatase (PTPN22) Inhibition Assay PubChem Bioassay(2012)[AID]
 
Tyrosine-protein phosphatase non-receptor type 22
Name:Tyrosine-protein phosphatase non-receptor type 22
Type:n/a
Mol. Mass.:91712.31
Organism:Homo sapiens (Human)
Description:Q9Y2R2
Residue:807
BDBM88760
NameBDBM88760
Synonyms:(4-benzylpiperazin-1-yl)-[4-(dimethylamino)phenyl]methanethione 4-[(4-benzyl-1-piperazinyl)carbonothioyl]-N,N-dimethylaniline SMR000296756 [4-(dimethylamino)phenyl]-[4-(phenylmethyl)piperazin-1-yl]methanethione | cid_2237734
TypeSmall organic molecule
Emp. Form.C20H25N3S
Mol. Mass.339.498
SMILESCN(C)c1ccc(cc1)C(=S)N1CCN(Cc2ccccc2)CC1