Reaction Details
TargetTyrosine-protein phosphatase non-receptor type 22
LigandBDBM88774
Substrate/Competitorn/a
Meas. Tech.Dose Response selectivity of inhibitors of STriatal-Enriched Phosphatase (STEP) in the Lymphoid Phosphatase (PTPN22) Inhibition Assay
IC50 11512±562 nM
Citation PubChem, PC Dose Response selectivity of inhibitors of STriatal-Enriched Phosphatase (STEP) in the Lymphoid Phosphatase (PTPN22) Inhibition Assay PubChem Bioassay(2012)[AID]
 
Tyrosine-protein phosphatase non-receptor type 22
Name:Tyrosine-protein phosphatase non-receptor type 22
Type:n/a
Mol. Mass.:91712.31
Organism:Homo sapiens (Human)
Description:Q9Y2R2
Residue:807
BDBM88774
NameBDBM88774
Synonyms:(4-hydroxy-6-keto-1H-pyrimidin-2-yl)cyanamide (4-oxidanyl-6-oxidanylidene-1H-pyrimidin-2-yl)cyanamide SMR000528279 | cid_246750
TypeSmall organic molecule
Emp. Form.C5H4N4O2
Mol. Mass.152.1109
SMILESOc1cc(=O)[nH]c(NC#N)n1