Reaction Details
TargetTyrosine-protein phosphatase non-receptor type 22
LigandBDBM84008
Substrate/Competitorn/a
Meas. Tech.Dose Response selectivity of inhibitors of STriatal-Enriched Phosphatase (STEP) in the Lymphoid Phosphatase (PTPN22) Inhibition Assay
IC50 2824±96 nM
Citation PubChem, PC Dose Response selectivity of inhibitors of STriatal-Enriched Phosphatase (STEP) in the Lymphoid Phosphatase (PTPN22) Inhibition Assay PubChem Bioassay(2012)[AID]
 
Tyrosine-protein phosphatase non-receptor type 22
Name:Tyrosine-protein phosphatase non-receptor type 22
Type:n/a
Mol. Mass.:91712.31
Organism:Homo sapiens (Human)
Description:Q9Y2R2
Residue:807
BDBM84008
NameBDBM84008
Synonyms:2-[[4-[2-[(4-methylsulfanylphenyl)methylidene]hydrazinyl]-3-nitro-phenyl]sulfonylamino]benzoic acid 2-[[4-[2-[[4-(methylthio)phenyl]methylidene]hydrazinyl]-3-nitrophenyl]sulfonylamino]benzoic acid MLS002245633 cid_3292268
TypeSmall organic molecule
Emp. Form.C21H18N4O6S2
Mol. Mass.486.521
SMILESCSc1ccc(CN=Nc2ccc(cc2[N+]([O-])=O)S(=O)(=O)Nc2ccccc2C(O)=O)cc1