Reaction Details
TargetTyrosine-protein phosphatase non-receptor type 22
LigandBDBM50328746
Substrate/Competitorn/a
Meas. Tech.Dose Response selectivity of inhibitors of STriatal-Enriched Phosphatase (STEP) in the Lymphoid Phosphatase (PTPN22) Inhibition Assay
IC50 5090±189 nM
Citation PubChem, PC Dose Response selectivity of inhibitors of STriatal-Enriched Phosphatase (STEP) in the Lymphoid Phosphatase (PTPN22) Inhibition Assay PubChem Bioassay(2012)[AID]
 
Tyrosine-protein phosphatase non-receptor type 22
Name:Tyrosine-protein phosphatase non-receptor type 22
Type:n/a
Mol. Mass.:91712.31
Organism:Homo sapiens (Human)
Description:Q9Y2R2
Residue:807
BDBM50328746
NameBDBM50328746
Synonyms:4-hydroxy-6-(phenylamino)naphthalene-2-sulfonate cid_67062
TypeSmall organic molecule
Emp. Form.C16H13NO4S
Mol. Mass.315.344
SMILESOc1cc(cc2ccc(Nc3ccccc3)cc12)S(O)(=O)=O