Reaction Details
TargetTyrosine-protein phosphatase non-receptor type 22
LigandBDBM83199
Substrate/Competitorn/a
Meas. Tech.Dose Response selectivity of inhibitors of STriatal-Enriched Phosphatase (STEP) in the Lymphoid Phosphatase (PTPN22) Inhibition Assay
IC50 8338±1280 nM
Citation PubChem, PC Dose Response selectivity of inhibitors of STriatal-Enriched Phosphatase (STEP) in the Lymphoid Phosphatase (PTPN22) Inhibition Assay PubChem Bioassay(2012)[AID]
 
Tyrosine-protein phosphatase non-receptor type 22
Name:Tyrosine-protein phosphatase non-receptor type 22
Type:n/a
Mol. Mass.:91712.31
Organism:Homo sapiens (Human)
Description:Q9Y2R2
Residue:807
BDBM83199
NameBDBM83199
Synonyms:2-[7-(dihydroxymethylene)-5,6-diketo-cyclohepta-1,3-dien-1-yl]acetic acid 2-[7-(dihydroxymethylidene)-5,6-dioxocyclohepta-1,3-dien-1-yl]acetic acid 7-(carboxymethyl)-2-hydroxy-3-keto-cyclohepta-1,4,6-triene-1-carboxylic acid SMR001570292 | cid_5380595
TypeSmall organic molecule
Emp. Form.C10H8O6
Mol. Mass.224.1669
SMILESOC(=O)Cc1cccc(=O)c(O)c1C(O)=O