Reaction Details
TargetProstaglandin G/H synthase 1 [582-599]
LigandBDBM17638
Substrate/Competitorn/a
Meas. Tech.Enzyme Inhibition Assay
IC50 2.6e+2± 3.2e+2 nM
Citation Bekhit, AAAshour, HMBekhit, Ael-DAbdel-Rahman, HMBekhit, SA Synthesis of some pyrazolyl benzenesulfonamide derivatives as dual anti-inflammatory antimicrobial agents. J Enzyme Inhib Med Chem24:296-309 (2009) 
 
Prostaglandin G/H synthase 1 [582-599]
Name:Prostaglandin G/H synthase 1 [582-599]
Type:Protein
Mol. Mass.:1879.89
Organism:Homo sapiens (Human)
Description:Q6LCE7
Residue:18
PDASQDDGPAVERPSTEL
BDBM17638
NameBDBM17638
Synonyms:2-{1-[(4-chlorophenyl)carbonyl]-5-methoxy-2-methyl-1H-indol-3-yl}acetic acid Indocin US11478464, Compound Indomethacin US9271961, Indomethacin | indometacin
TypeSmall organic molecule
Emp. Form.C19H16ClNO4
Mol. Mass.357.788
SMILESCOc1ccc2n(C(=O)c3ccc(Cl)cc3)c(C)c(CC(O)=O)c2c1