Reaction Details
TargetCytochrome P450 26A1
LigandBDBM91698
Substrate/Competitorn/a
Meas. Tech.Cell Assay
EC50 3.5e+4±0 nM
Citation Pautus, SAboraia, ASBassett, CEBrancale, ACoogan, MPSimons, C Design and synthesis of substituted imidazole and triazole N-phenylbenzo[d]oxazolamine inhibitors of retinoic acid metabolizing enzyme CYP26. J Enzyme Inhib Med Chem24:487-98 (2009) 
 
Cytochrome P450 26A1
Name:Cytochrome P450 26A1
Type:Enzyme
Mol. Mass.:56216.16
Organism:Homo sapiens (Human)
Description:O43174
Residue:497
BDBM91698
NameBDBM91698
Synonyms:Oxazolamine derivative, 5a
TypeSmall organic molecule
Emp. Form.C23H17FN4O
Mol. Mass.384.4057
SMILESFc1ccc(cc1)C(c1ccc(Nc2nc3ccccc3o2)cc1)n1ccnc1