Reaction Details
TargetCarbonic anhydrase 1
LigandBDBM91711
Substrate/Competitorn/a
Meas. Tech.Inhibition Assay
Ki 1237±0.0 nM
Citation Morsy, SMBadawi, AMCecchi, AScozzafava, ASupuran, CT Carbonic anhydrase inhibitors. Biphenylsulfonamides with inhibitory action towards the transmembrane, tumor-associated isozymes IX possess cytotoxic activity against human colon, lung and breast cancer cell lines. J Enzyme Inhib Med Chem24:499-505 (2009) 
 
Carbonic anhydrase 1
Name:Carbonic anhydrase 1
Type:Enzyme
Mol. Mass.:28873.37
Organism:Homo sapiens (Human)
Description:P00915
Residue:261
BDBM91711
NameBDBM91711
Synonyms:Sulfonamide, 13
TypeSmall organic molecule
Emp. Form.C24H22Cl2N6O12S6
Mol. Mass.849.76
SMILESNS(=O)(=O)c1cc(c(NS(=O)(=O)c2ccc(cc2)-c2ccc(cc2)S(=O)(=O)Nc2cc(Cl)c(cc2S(N)(=O)=O)S(N)(=O)=O)cc1Cl)S(N)(=O)=O