Reaction Details
TargetCarbonic anhydrase 9
LigandBDBM50160672
Substrate/Competitorn/a
Meas. Tech.Inhibition Assay
Ki 37±0.0 nM
Citation Morsy, SMBadawi, AMCecchi, AScozzafava, ASupuran, CT Carbonic anhydrase inhibitors. Biphenylsulfonamides with inhibitory action towards the transmembrane, tumor-associated isozymes IX possess cytotoxic activity against human colon, lung and breast cancer cell lines. J Enzyme Inhib Med Chem24:499-505 (2009) 
 
Carbonic anhydrase 9
Name:Carbonic anhydrase 9
Type:Enzyme
Mol. Mass.:49669.03
Organism:Homo sapiens (Human)
Description:Catalytic domain of human cloned isozyme was used in the assay
Residue:459
BDBM50160672
NameBDBM50160672
Synonyms:4-((R)-Ethylamino)-6-(3-methoxy-propyl)-7,7-dioxo-4,5,6,7-tetrahydro-7lambda*6*-thieno[2,3-b]thiopyran-2-sulfonic acid amide CHEMBL281584 | Sulfonamide, 6
TypeSmall organic molecule
Emp. Form.C13H22N2O5S3
Mol. Mass.382.519
SMILESCCNC1CC(CCCOC)S(=O)(=O)c2sc(cc12)S(N)(=O)=O