Reaction Details
TargetCarbonic anhydrase 9
LigandBDBM91709
Substrate/Competitorn/a
Meas. Tech.Inhibition Assay
Ki 59±0.0 nM
Citation Morsy, SMBadawi, AMCecchi, AScozzafava, ASupuran, CT Carbonic anhydrase inhibitors. Biphenylsulfonamides with inhibitory action towards the transmembrane, tumor-associated isozymes IX possess cytotoxic activity against human colon, lung and breast cancer cell lines. J Enzyme Inhib Med Chem24:499-505 (2009) 
 
Carbonic anhydrase 9
Name:Carbonic anhydrase 9
Type:Enzyme
Mol. Mass.:49669.03
Organism:Homo sapiens (Human)
Description:Catalytic domain of human cloned isozyme was used in the assay
Residue:459
BDBM91709
NameBDBM91709
Synonyms:Sulfonamide, 11
TypeSmall organic molecule
Emp. Form.C24H22N4O8S4
Mol. Mass.622.713
SMILESNS(=O)(=O)c1ccc(NS(=O)(=O)c2ccc(cc2)-c2ccc(cc2)S(=O)(=O)Nc2ccc(cc2)S(N)(=O)=O)cc1