Reaction Details
TargetCarbonic anhydrase 12
LigandBDBM50094370
Substrate/Competitorn/a
Meas. Tech.Inhibition Assay
Ki 3.5±0.0 nM
Citation Morsy, SMBadawi, AMCecchi, AScozzafava, ASupuran, CT Carbonic anhydrase inhibitors. Biphenylsulfonamides with inhibitory action towards the transmembrane, tumor-associated isozymes IX possess cytotoxic activity against human colon, lung and breast cancer cell lines. J Enzyme Inhib Med Chem24:499-505 (2009) 
 
Carbonic anhydrase 12
Name:Carbonic anhydrase 12
Type:Enzyme
Mol. Mass.:39456.00
Organism:Homo sapiens (Human)
Description:Catalytic domain of human cloned isozyme was used in the assay
Residue:354
BDBM50094370
NameBDBM50094370
Synonyms:CHEMBL22821 | Sulfonamide, 5
TypeSmall organic molecule
Emp. Form.C10H16N2O4S3
Mol. Mass.324.44
SMILESCCNC1C[C@H](C)S(=O)(=O)c2sc(cc12)S(N)(=O)=O