Reaction Details
TargetCarbonic anhydrase 12
LigandBDBM91710
Substrate/Competitorn/a
Meas. Tech.Inhibition Assay
Ki 213±0.0 nM
Citation Morsy, SMBadawi, AMCecchi, AScozzafava, ASupuran, CT Carbonic anhydrase inhibitors. Biphenylsulfonamides with inhibitory action towards the transmembrane, tumor-associated isozymes IX possess cytotoxic activity against human colon, lung and breast cancer cell lines. J Enzyme Inhib Med Chem24:499-505 (2009) 
 
Carbonic anhydrase 12
Name:Carbonic anhydrase 12
Type:Enzyme
Mol. Mass.:39456.00
Organism:Homo sapiens (Human)
Description:Catalytic domain of human cloned isozyme was used in the assay
Residue:354
BDBM91710
NameBDBM91710
Synonyms:Sulfonamide, 12
TypeSmall organic molecule
Emp. Form.C28H30N4O8S4
Mol. Mass.678.82
SMILESNS(=O)(=O)c1ccc(CCNS(=O)(=O)c2ccc(cc2)-c2ccc(cc2)S(=O)(=O)NCCc2ccc(cc2)S(N)(=O)=O)cc1