Reaction Details
TargetCholinesterase
LigandBDBM91713
Substrate/Competitorn/a
Meas. Tech.Cholinesterase Inhibition Assay
IC50 1.55e+3± 4e+1 nM
Citation Al-Aboudi, AOdeh, HKhalid, ANaz, QChoudhary, MI Butyrylcholinesterase inhibitory activity of testosterone and some of its metabolites. J Enzyme Inhib Med Chem24:553-8 (2009) 
 
Cholinesterase
Name:Cholinesterase
Type:Homotetramer
Mol. Mass.:68422.27
Organism:Homo sapiens (Human)
Description:P06276
Residue:602
BDBM91713
NameBDBM91713
Synonyms:Androst-4-en-3,17-dione, 2 Androstenedione
TypeSmall organic molecule
Emp. Form.C19H26O2
Mol. Mass.286.4085
SMILESC[C@]12CC[C@H]3[C@@H](CCC4=CC(=O)CC[C@]34C)[C@@H]1CCC2=O