Reaction Details
TargetCyclin-A2/Cyclin-dependent kinase 2
LigandBDBM91761
Substrate/Competitorn/a
Meas. Tech.OctetRed
pH7.5±n/a
Temperature298.15±n/a K
Kd 62±12 nM
Citation CSARdock, CD CDK2-CyclinA in CSAR_FULL_RELEASE_3JULY2012 CSAR1:0 (2012)  
 
Cyclin-A2/Cyclin-dependent kinase 2
Name:Cyclin-A2/Cyclin-dependent kinase 2
Type:Protein Complex
Mol. Mass.:n/a
Description:Cdk2/Cyclin A kinase was purified from insect cells coinfected with Cyclin A/Cdk2 baculovirus.
Components:This complex has 2 components.
Component 1
Name:Cyclin-dependent kinase 2
Synonyms:CDK2 CDK2_HUMAN Cell division protein kinase 2 Protein cereblon/Cyclin-dependent kinase 2 | p33 protein kinase
Type:Enzyme Subunit
Mol. Mass.:33938.17
Organism:Homo sapiens (Human)
Description:P24941
Residue:298
Component 2
Name:Cyclin-A2
Synonyms:CCN1 CCNA1 CCNA2_HUMAN Cyclin-A
Type:Enzyme Subunit
Mol. Mass.:48550.19
Organism:Homo sapiens (Human)
Description:P20248
Residue:432
BDBM91761
NameBDBM91761
Synonyms:CS19
Typen/a
Emp. Form.C17H18N6O2S
Mol. Mass.370.429
SMILESCN(C)c1ccc(Nc2nccc(n2)-c2sc(C)nc2C)cc1[N+]([O-])=O