Reaction Details
TargetSerine/threonine-protein kinase Chk1
LigandBDBM91966
Substrate/Competitorn/a
Meas. Tech.ChemBL affinity - Published Abbott papers
Ki 8±n/a nM
Citation CSARdock, CD CHK1 in CSAR_FULL_RELEASE_3JULY2012 CSAR1:0 (2012)  
 
Serine/threonine-protein kinase Chk1
Name:Serine/threonine-protein kinase Chk1
Type:Enzyme Catalytic Domain
Mol. Mass.:54443.02
Organism:Homo sapiens (Human)
Description:gi_166295192
Residue:476
BDBM91966
NameBDBM91966
Synonyms:Chk1_97
Typen/a
Emp. Form.C23H21N3O4
Mol. Mass.403.4305
SMILESCOC(=O)Cc1ccc2Nc3cc(ccc3C(=O)Nc2c1)-c1cc(OC)ncc1C