Reaction Details
TargetSerine/threonine-protein kinase Chk1
LigandBDBM91883
Substrate/Competitorn/a
Meas. Tech.ChemBL affinity - Published Abbott papers
Ki 25±n/a nM
Citation CSARdock, CD CHK1 in CSAR_FULL_RELEASE_3JULY2012 CSAR1:0 (2012)  
 
Serine/threonine-protein kinase Chk1
Name:Serine/threonine-protein kinase Chk1
Type:Enzyme Catalytic Domain
Mol. Mass.:54443.02
Organism:Homo sapiens (Human)
Description:gi_166295192
Residue:476
BDBM91883
NameBDBM91883
Synonyms:Chk1_19
Typen/a
Emp. Form.C16H15ClN6O2
Mol. Mass.358.782
SMILESClc1ccc(OC2CCNC2)c(NC(=O)Nc2cnc(cn2)C#N)c1