Reaction Details
TargetSerine/threonine-protein kinase Chk1
LigandBDBM91906
Substrate/Competitorn/a
Meas. Tech.ChemBL affinity - Published Abbott papers
Ki 1±n/a nM
Citation CSARdock, CD CHK1 in CSAR_FULL_RELEASE_3JULY2012 CSAR1:0 (2012)  
 
Serine/threonine-protein kinase Chk1
Name:Serine/threonine-protein kinase Chk1
Type:Enzyme Catalytic Domain
Mol. Mass.:54443.02
Organism:Homo sapiens (Human)
Description:gi_166295192
Residue:476
BDBM91906
NameBDBM91906
Synonyms:Chk1_40
Typen/a
Emp. Form.C17H17BrN6O2
Mol. Mass.417.26
SMILESOC1CCCN(C1)c1ccc(Br)cc1NC(=O)Nc1cnc(cn1)C#N