Reaction Details
TargetSerine/threonine-protein kinase Chk1
LigandBDBM50214577
Substrate/Competitorn/a
Meas. Tech.Abbott Kinase Enzymatics_CHK1/289 CDC25c
IC50 2±n/a nM
Citation CSARdock, CD CHK1 in CSAR_FULL_RELEASE_3JULY2012 CSAR1:0 (2012)  
 
Serine/threonine-protein kinase Chk1
Name:Serine/threonine-protein kinase Chk1
Type:Enzyme Catalytic Domain
Mol. Mass.:54443.02
Organism:Homo sapiens (Human)
Description:gi_166295192
Residue:476
BDBM50214577
NameBDBM50214577
Synonyms:4'-(6,7-dimethoxy-1,4-dihydro-indeno[1,2-c]pyrazol-3-yl)-biphenyl-4-ol 4'-(6,7-dimethoxy-2,4-dihydro-indeno[1,2-c]pyrazol-3-yl)-biphenyl-4-ol Chk1_115
TypeSmall organic molecule
Emp. Form.C24H20N2O3
Mol. Mass.384.4272
SMILESCOc1cc2Cc3c(n[nH]c3-c2cc1OC)-c1ccc(cc1)-c1ccc(O)cc1