Reaction Details
TargetSerine/threonine-protein kinase Chk1
LigandBDBM91827
Substrate/Competitorn/a
Meas. Tech.ChemBL affinity - Published Abbott papers
IC50 4.4±n/a nM
Citation CSARdock, CD CHK1 in CSAR_FULL_RELEASE_3JULY2012 CSAR1:0 (2012)  
 
Serine/threonine-protein kinase Chk1
Name:Serine/threonine-protein kinase Chk1
Type:Enzyme Catalytic Domain
Mol. Mass.:54443.02
Organism:Homo sapiens (Human)
Description:gi_166295192
Residue:476
BDBM91827
NameBDBM91827
Synonyms:CHEMBL232804 | Chk1_101
Typen/a
Emp. Form.C23H18N2O2
Mol. Mass.354.4012
SMILESOCc1ccc2Cc3c([nH]nc3-c3ccc(cc3)-c3ccc(O)cc3)-c2c1