Reaction Details
TargetMitogen-activated protein kinase 1
LigandBDBM92039
Substrate/Competitorn/a
Meas. Tech.Assay 1
Ki 1.0±n/a nM
Citation CSARdock, CD ERK2 in CSAR_FULL_RELEASE_3JULY2012 CSAR1:0 (2012)  
 
Mitogen-activated protein kinase 1
Name:Mitogen-activated protein kinase 1
Type:Ser/Thr Protein Kinase
Mol. Mass.:41392.76
Organism:Homo sapiens (Human)
Description:P28482
Residue:360
BDBM92039
NameBDBM92039
Synonyms:erk000445
Typen/a
Emp. Form.C26H27N5O3
Mol. Mass.457.5243
SMILESCc1cnc(N[C@H](CO)c2ccccc2)nc1-c1c[nH]c(c1)C(=O)N[C@H](CO)c1ccccc1