Reaction Details
TargetMitogen-activated protein kinase 1
LigandBDBM15621
Substrate/Competitorn/a
Meas. Tech.Assay 1
Ki 85±n/a nM
Citation CSARdock, CD ERK2 in CSAR_FULL_RELEASE_3JULY2012 CSAR1:0 (2012)  
 
Mitogen-activated protein kinase 1
Name:Mitogen-activated protein kinase 1
Type:Ser/Thr Protein Kinase
Mol. Mass.:41392.76
Organism:Homo sapiens (Human)
Description:P28482
Residue:360
BDBM15621
NameBDBM15621
Synonyms:N-Benzyl-4-(4-(3-chlorophenyl)-1H-pyrazol-3-yl)-1H-pyrrole-2-carboxamide Pyrrole Carboxamide Analog 5g | erk000092
TypeSmall organic molecule
Emp. Form.C21H17ClN4O
Mol. Mass.376.839
SMILESClc1cccc(c1)-c1c[nH]nc1-c1c[nH]c(c1)C(=O)NCc1ccccc1