Reaction Details
TargetMitogen-activated protein kinase 1
LigandBDBM35664
Substrate/Competitorn/a
Meas. Tech.Assay 1
Ki 15±n/a nM
Citation CSARdock, CD ERK2 in CSAR_FULL_RELEASE_3JULY2012 CSAR1:0 (2012)  
 
Mitogen-activated protein kinase 1
Name:Mitogen-activated protein kinase 1
Type:Ser/Thr Protein Kinase
Mol. Mass.:41392.76
Organism:Homo sapiens (Human)
Description:P28482
Residue:360
BDBM35664
NameBDBM35664
Synonyms:erk000628 | pyrimidylpyrrole, 11l
TypeSmall organic molecule
Emp. Form.C26H24ClN5O4
Mol. Mass.505.953
SMILESCc1cnc(Nc2cccc3OCCOc23)nc1-c1c[nH]c(c1)C(=O)N[C@H](CO)c1cccc(Cl)c1