Reaction Details
TargetMitogen-activated protein kinase 1
LigandBDBM92106
Substrate/Competitorn/a
Meas. Tech.Assay 1
Ki 2±n/a nM
Citation CSARdock, CD ERK2 in CSAR_FULL_RELEASE_3JULY2012 CSAR1:0 (2012)  
 
Mitogen-activated protein kinase 1
Name:Mitogen-activated protein kinase 1
Type:Ser/Thr Protein Kinase
Mol. Mass.:41392.76
Organism:Homo sapiens (Human)
Description:P28482
Residue:360
BDBM92106
NameBDBM92106
Synonyms:erk000538
Typen/a
Emp. Form.C25H24FN5O2
Mol. Mass.445.4888
SMILESCc1cnc(Nc2cccc(F)c2C)nc1-c1c[nH]c(c1)C(=O)N[C@H](CO)c1ccccc1