Reaction Details
TargetMitogen-activated protein kinase 1
LigandBDBM92141
Substrate/Competitorn/a
Meas. Tech.Assay 1
Ki 1.0±n/a nM
Citation CSARdock, CD ERK2 in CSAR_FULL_RELEASE_3JULY2012 CSAR1:0 (2012)  
 
Mitogen-activated protein kinase 1
Name:Mitogen-activated protein kinase 1
Type:Ser/Thr Protein Kinase
Mol. Mass.:41392.76
Organism:Homo sapiens (Human)
Description:P28482
Residue:360
BDBM92141
NameBDBM92141
Synonyms:erk000587
Typen/a
Emp. Form.C23H28N6O2
Mol. Mass.420.5074
SMILESCc1cnc(NN2CCCCC2)nc1-c1c[nH]c(c1)C(=O)N[C@H](CO)c1ccccc1