Reaction Details
TargetMitogen-activated protein kinase 1
LigandBDBM92122
Substrate/Competitorn/a
Meas. Tech.Assay 1
Ki 2±n/a nM
Citation CSARdock, CD ERK2 in CSAR_FULL_RELEASE_3JULY2012 CSAR1:0 (2012)  
 
Mitogen-activated protein kinase 1
Name:Mitogen-activated protein kinase 1
Type:Ser/Thr Protein Kinase
Mol. Mass.:41392.76
Organism:Homo sapiens (Human)
Description:P28482
Residue:360
BDBM92122
NameBDBM92122
Synonyms:erk000558
Typen/a
Emp. Form.C22H25ClN6O3
Mol. Mass.456.925
SMILESCc1cnc(NN2CCOCC2)nc1-c1c[nH]c(c1)C(=O)N[C@H](CO)c1cccc(Cl)c1