Reaction Details
TargetMitogen-activated protein kinase 1
LigandBDBM92148
Substrate/Competitorn/a
Meas. Tech.Assay 1
Ki 3±n/a nM
Citation CSARdock, CD ERK2 in CSAR_FULL_RELEASE_3JULY2012 CSAR1:0 (2012)  
 
Mitogen-activated protein kinase 1
Name:Mitogen-activated protein kinase 1
Type:Ser/Thr Protein Kinase
Mol. Mass.:41392.76
Organism:Homo sapiens (Human)
Description:P28482
Residue:360
BDBM92148
NameBDBM92148
Synonyms:erk000599
Typen/a
Emp. Form.C21H25N5O3
Mol. Mass.395.4549
SMILESCCONc1ncc(C)c(n1)-c1c[nH]c(c1)C(=O)N[C@H](CO)c1cccc(C)c1